{"text_format":"1","workbook":"xlsx","n_sheets":10,"sheets":["Guida","Esempio_1","Esempio_2","Esempio_3","Progettazioni","Prestazioni","Parametri","CALCOLO CS","Elenchi","SA"],"not_rendered":{"charts":0,"images":2,"macros":1,"external_links":1,"defined_names":18,"comments":4,"pivot_tables":0},"unopened":[],"bounds":{"document_bytes":16777216,"sheet_cells":100000,"rows_first":2000,"rows_last":500,"rows_between":2000,"halvings":0,"cell_chars":16384,"cell_head_chars":4096},"cells_cut":0,"cells_raw":0,"read":"whole","date_system":"1900"}

{"sheet":"Guida","index":0,"n_rows":43,"n_cols":2,"rows_kept":43,"cut":false,"hidden":false,"merged":[[0,0,0,1],[1,0,1,1],[21,0,21,1],[6,0,6,1],[3,0,3,1],[4,0,4,1],[5,0,5,1],[16,0,16,1],[17,0,17,1],[18,0,18,1],[20,0,20,1],[19,0,19,1],[23,0,23,1],[24,0,24,1],[25,0,25,1],[26,0,26,1],[27,0,27,1],[29,0,29,1],[30,0,30,1],[41,0,41,1],[28,0,28,1],[31,0,31,1],[33,0,33,1],[32,0,32,1],[42,0,42,1],[39,0,39,1],[40,0,40,1],[34,0,34,1],[35,0,35,1],[38,0,38,1],[37,0,37,1]]}
["PSR CAMPANIA 2014-2020 - Tipologia di Intervento 4.1.1 - azione A e azione B"]
["Spese generali - definizioni e procedura di inserimento dati"]
[]
["Metodo di calcolo del Costo Semplificato delle Spese di Progettazione (compenso del professionista)"]
[]
[]
["Definizioni"]
["Spese di Progettazione","Le spese di progettazione, che rappresentano il compenso del progettista o dei progettisti coinvolti nella presentazione delle domande di sostegno e nell'elaborazione degli elaborati necessari alla realizzazione dell'investimento (spese per agronomi, ingegneri, architetti, periti, ecc.), rappresentano una voce non secondaria delle spese ammesse a beneficiare del contributo delle sottomisure 4.1 –  sostegno a investimenti nelle aziende agricole.  La presente metodologia non intende quantificare il compenso effettivo del progettista, che è lasciato alla libera contrattazione tra le parti nel rispetto della normativa vigente. Essa è infatti finalizzata all’individuazione della spesa ammissibile, ovvero del valore “standard” delle spese di progettazione che l’Autorità pubblica è disposta a finanziare con i fondi dello sviluppo rurale. La presente metodologia di calcolo considera le \"Spese di Progettazione\" in funzione della tipologia di investimento o di opera (oggetto della progettazione) ed in funzione del numero e della tipologia di prestazioni operate dal consulente all'interno di ciascuna progettazione."]
["Categorie","Gli investimenti possono rientrare in una delle seguenti categorie: Edilizia, Impianti, Ruralità. La classificazione degli investimenti in queste categorie, così come i parametri di complessità delle opere, le prestazioni e i valori stessi delle prestazioni sono stati mutuati dal DM 17/06/2016."]
["Edilizia 1","Investimenti per la realizzazione ex novo di edifici e/o strutture di tipo complesso destinati alla produzione, trasformazione, commercializzazione e/o sviluppo di prodotti agricoli, comprensiva di impianti civili di servizio agli edifici (p.e. impianto elettrico, impianto riscaldamento/raffrescamento, impianto idrico, ecc.). Rientrano in questa tipologia di investimento gli edifici destinati ad ospitare stalle, cantine, frantoi, ecc."]
{"$rows_left_out":34}
{"sheet":"Esempio_1","index":1,"n_rows":96,"n_cols":12,"rows_kept":96,"cut":false,"hidden":false,"merged":[[7,1,9,1],[7,2,9,2],[7,3,9,3],[7,6,12,6],[0,0,0,6],[1,1,1,6],[3,0,3,6],[4,1,4,6],[5,2,5,5],[16,1,16,6],[17,2,17,6],[19,1,21,1],[19,2,21,2],[19,3,21,3],[19,6,24,6],[28,1,28,6],[29,2,29,6],[31,1,33,1],[31,2,33,2],[31,3,33,3],[31,6,36,6],[40,1,40,6],[41,2,41,6],[43,1,45,1],[43,2,45,2],[43,3,45,3],[43,6,48,6],[52,1,52,6],[53,2,53,6],[55,1,57,1],[55,2,57,2],[55,3,57,3],[55,6,60,6],[84,0,84,4],[64,1,64,6],[65,2,65,6],[67,1,69,1],[67,2,69,2],[67,3,69,3],[67,6,72,6],[76,0,77,6],[79,0,79,4],[80,0,80,4],[81,0,81,4],[83,0,83,6],[85,0,85,4],[85,6,91,6],[86,0,86,4],[87,0,87,4],[88,0,88,4],[89,0,89,4],[90,0,90,4],[91,0,91,4],[94,9,95,9],[92,0,92,4],[93,0,93,1],[94,2,95,5],[94,6,95,6],[94,7,95,7],[94,8,95,8]]}
["CALCOLO SPESE GENERALI (spese di progettazione e altre spese generali)"]
["RICHIEDENTE"]
[]
["SPESE DI PROGETTAZIONE - COSTI SEMPLIFICATI",null,null,null,null,null,null,"importo max richiedibile","importo max delle spese generali"]
["Progettazione 1"," Edifici rurali di tipo complesso"]
["Vp1",500000]
[null,"Relazione geologica","Studio Impatto Ambientale (VIA)","Piano di monitoraggio ambientale (VIA)","Altre prestazioni","costo semplificato P1","costo semplificato P1 nel rispetto dei limiti previsti dalle D.G.","Totale spesa progettazioni P1-P2-P4-P5 (PT)",1000000]
["P",null,null,null,6.9810717055349719E-2,null,null,null,50000,0.1,0,500000]
["Q",null,null,null,1.27,null,null,null,25000,0.05,500000,1000000]
["G",null,null,null,0.95,null,null,null,0,2.5000000000000001E-2,1000000]
{"$rows_left_out":87}
{"sheet":"Esempio_2","index":2,"n_rows":96,"n_cols":12,"rows_kept":96,"cut":false,"hidden":false,"merged":[[7,1,9,1],[7,2,9,2],[7,3,9,3],[7,6,12,6],[0,0,0,6],[1,1,1,6],[3,0,3,6],[4,1,4,6],[5,2,5,5],[16,1,16,6],[17,2,17,6],[19,1,21,1],[19,2,21,2],[19,3,21,3],[19,6,24,6],[28,1,28,6],[29,2,29,6],[31,1,33,1],[31,2,33,2],[31,3,33,3],[31,6,36,6],[40,1,40,6],[41,2,41,6],[43,1,45,1],[43,2,45,2],[43,3,45,3],[43,6,48,6],[52,1,52,6],[53,2,53,6],[55,1,57,1],[55,2,57,2],[55,3,57,3],[55,6,60,6],[84,0,84,4],[64,1,64,6],[65,2,65,6],[67,1,69,1],[67,2,69,2],[67,3,69,3],[67,6,72,6],[76,0,77,6],[79,0,79,4],[80,0,80,4],[81,0,81,4],[83,0,83,6],[85,0,85,4],[85,6,91,6],[86,0,86,4],[87,0,87,4],[88,0,88,4],[89,0,89,4],[90,0,90,4],[91,0,91,4],[94,9,95,9],[92,0,92,4],[93,0,93,1],[94,2,95,5],[94,6,95,6],[94,7,95,7],[94,8,95,8]]}
["CALCOLO SPESE GENERALI (spese di progettazione e altre spese generali)"]
["RICHIEDENTE"]
[]
["SPESE DI PROGETTAZIONE - COSTI SEMPLIFICATI",null,null,null,null,null,null,"importo max richiedibile","importo max delle spese generali"]
["Progettazione 1"," Edifici rurali di tipo complesso"]
["Vp1",500000]
[null,"Relazione geologica","Studio Impatto Ambientale (VIA)","Piano di monitoraggio ambientale (VIA)","Altre prestazioni","costo semplificato P1","costo semplificato P1 nel rispetto dei limiti previsti dalle D.G.","Totale spesa progettazioni P1-P2-P4-P5 (PT)",1000000]
["P",null,null,null,6.9810717055349719E-2,null,null,null,50000,0.1,0,500000]
["Q",null,null,null,1.27,null,null,null,25000,0.05,500000,1000000]
["G",null,null,null,0.95,null,null,null,0,2.5000000000000001E-2,1000000]
{"$rows_left_out":87}
{"sheet":"Esempio_3","index":3,"n_rows":96,"n_cols":12,"rows_kept":96,"cut":false,"hidden":false,"merged":[[7,1,9,1],[7,2,9,2],[7,3,9,3],[7,6,12,6],[0,0,0,6],[1,1,1,6],[3,0,3,6],[4,1,4,6],[5,2,5,5],[16,1,16,6],[17,2,17,6],[19,1,21,1],[19,2,21,2],[19,3,21,3],[19,6,24,6],[28,1,28,6],[29,2,29,6],[31,1,33,1],[31,2,33,2],[31,3,33,3],[31,6,36,6],[40,1,40,6],[41,2,41,6],[43,1,45,1],[43,2,45,2],[43,3,45,3],[43,6,48,6],[52,1,52,6],[53,2,53,6],[55,1,57,1],[55,2,57,2],[55,3,57,3],[55,6,60,6],[84,0,84,4],[64,1,64,6],[65,2,65,6],[67,1,69,1],[67,2,69,2],[67,3,69,3],[67,6,72,6],[76,0,77,6],[79,0,79,4],[80,0,80,4],[81,0,81,4],[83,0,83,6],[85,0,85,4],[85,6,91,6],[86,0,86,4],[87,0,87,4],[88,0,88,4],[89,0,89,4],[90,0,90,4],[91,0,91,4],[94,9,95,9],[92,0,92,4],[93,0,93,1],[94,2,95,5],[94,6,95,6],[94,7,95,7],[94,8,95,8]]}
["CALCOLO SPESE GENERALI (spese di progettazione e altre spese generali)"]
["RICHIEDENTE"]
[]
["SPESE DI PROGETTAZIONE - COSTI SEMPLIFICATI",null,null,null,null,null,null,"importo max richiedibile","importo max delle spese generali"]
["Progettazione 1"," Edifici rurali di tipo complesso"]
["Vp1",850000]
[null,"Relazione geologica","Studio Impatto Ambientale (VIA)","Piano di monitoraggio ambientale (VIA)","Altre prestazioni","costo semplificato P1","costo semplificato P1 nel rispetto dei limiti previsti dalle D.G.","Totale spesa progettazioni P1-P2-P4-P5 (PT)",1350000]
["P",null,null,null,6.5307461368293726E-2,null,null,null,50000,0.1,0,500000]
["Q",null,null,null,1.27,null,null,null,25000,0.05,500000,1000000]
["G",null,null,null,0.95,null,null,null,8750,2.5000000000000001E-2,1000000]
{"$rows_left_out":87}
{"sheet":"Progettazioni","index":4,"n_rows":11,"n_cols":7,"rows_kept":11,"cut":false,"hidden":false,"merged":[[10,0,10,2],[2,0,2,1],[0,0,0,2]]}
["TIPOLOGIE DI PROGETTAZIONI",null,null,null,null,"Nota: inserire i valori nei campi verdi"]
[]
["Categoria",null,"Opere/Acquisizioni/Investimenti","G","Rif. DM","Valore delle Opere/Investimenti (V)"]
["Progettazione 1","EDILIZIA","Edilizia 1: Edifici rurali per l'attività agricola con corredi tecnici di tipo complesso ",0.95,"E.02",null,"Vp1"]
["Progettazione 2","EDILIZIA","Edilizia 2: Interventi di manutenzione straordinaria, ristrutturazione, riqualificazione su edifici e manufatti esistenti",0.95,"E.20",null,"Vp2"]
["Progettazione 3","IMPIANTI","Impianti: Impianti per la trasformazione, commercializzazione e/o sviluppo di prodotti agricoli. Impianti per la produzione di energia.",0.7,"IB.05",null,"Vp3"]
["Progettazione 4","EDILIZIA","Edilizia 3: Edifici rurali e/o strutture per l'attività agricola con corredi tecnici di tipo semplice (quali tettoie, depositi e ricoveri) ",0.65,"E.01",null,"Vp4"]
["Progettazione 5","RURALITA'","Miglioramenti fondiari",0.65,"/",null,"Vp5"]
["Progettazione 6","RURALITA'","Macchine e attrezzature",0.65,"/",null,"Vp6"]
[]
{"$rows_left_out":2}
{"sheet":"Prestazioni","index":5,"n_rows":31,"n_cols":42,"rows_kept":31,"cut":false,"hidden":false,"merged":[]}
["rif. DM",null,"DESCRIZIONE PRESTAZIONI PER LA DEFINIZIONE DEL PARAMETRO Q",null,"Progettazione 1","Progettazione 2","Progettazione 3","Progettazione 4","Progettazione 5","Progettazione 6",null,"Progettazione 1","Progettazione 2","Progettazione 3","Progettazione 4","Progettazione 5","Progettazione 6",null,"Progettazione 1","Progettazione 2","Progettazione 3","Progettazione 4","Progettazione 5","Progettazione 6",null,"Progettazione 1","Progettazione 2","Progettazione 3","Progettazione 4","Progettazione 5","Progettazione 6",null,"Progettazione 1","Progettazione 2","Progettazione 3","Progettazione 4","Progettazione 5","Progettazione 6",null,"Quota Valore Edilizia interessata dalla prestazione (ƩVp)","Quota Valore Impianti interessata dalla prestazione (ƩVp)","Quota Valore Ruralità interessata dalla prestazione (ƩVp)"]
[null,null,null,null,null,null,null,null,null,null,null,null,null,null,null,null,null,null,"E.01","E.20","IB.05","E.02","P.","P.",null,null,null,null,null,null,null,null,null,null,null,null,null,null,null,{"$f":"Progettazioni!F4+Progettazioni!F5+Progettazioni!F7","v":0},{"$f":"Progettazioni!F6","v":0},{"$f":"Progettazioni!F8+Progettazioni!F9","v":0}]
["QaI.01",null,"Relazione illustrativa",null,"n","n","n","n","n","þ",null,0,0,0,0,0,1,null,null,null,null,null,null,0.04,null,{"$f":"IF(LEN(L3)=1,L3,IF(L3=TRUE,1,0))*S3","v":0},0,0,0,0,0.04]
["QaI.02",null,"Relazione illustrativa, Elaborati progettuali e tecnico economici",null,"þ","þ","þ","þ","þ","n",null,1,1,1,1,1,0,null,0.09,0.09,0.09,0.09,0.08,null,null,{"$f":"IF(LEN(L4)=1,L4,IF(L4=TRUE,1,0))*S4","v":0.09},{"$f":"IF(LEN(M4)=1,M4,IF(M4=TRUE,1,0))*T4","v":0.09},{"$f":"IF(LEN(N4)=1,N4,IF(N4=TRUE,1,0))*U4","v":0.09},{"$f":"IF(LEN(O4)=1,O4,IF(O4=TRUE,1,0))*V4","v":0.09},{"$f":"IF(LEN(P4)=1,P4,IF(P4=TRUE,1,0))*W4","v":0.08},{"$f":"IF(LEN(Q4)=1,Q4,IF(Q4=TRUE,1,0))*X4","v":0}]
["QaIV.01",null,"Piani economici, aziendali, business plan e di investimento",null,"n","n","n","n","n","þ",null,0,0,0,0,0,1,null,null,null,null,null,null,5.0000000000000001E-3,null,0,0,0,0,0,5.0000000000000001E-3]
[]
["QbII.06",null,"Studio di inserimento urbanistico",null,null,null,"n",null,"n","n",null,false,false,0,false,0,0,null,0.03,0.03,null,0.03,null,null,null,{"$f":"IF(LEN(L7)=1,L7,IF(L7=TRUE,1,0))*S7","v":0},{"$f":"IF(LEN(M7)=1,M7,IF(M7=TRUE,1,0))*T7","v":0},{"$f":"IF(LEN(N7)=1,N7,IF(N7=TRUE,1,0))*U7","v":0},{"$f":"IF(LEN(O7)=1,O7,IF(O7=TRUE,1,0))*V7","v":0},{"$f":"IF(LEN(P7)=1,P7,IF(P7=TRUE,1,0))*W7","v":0},{"$f":"IF(LEN(Q7)=1,Q7,IF(Q7=TRUE,1,0))*X7","v":0}]
["QbII.07",null,"Rilievi planoaltimetrici",null,null,null,"n",null,null,"n",null,false,false,0,false,false,0,null,0.02,0.02,null,0.02,0.02,null,null,0,0,0,0,0,0]
["QbII.09",null,"Relazione geotecnica",null,"þ",null,"n",null,null,"n",null,1,false,0,false,false,0,null,0.06,0.06,null,0.06,0.06,null,null,0.06,{"$f":"IF(LEN(M9)=1,M9,IF(M9=TRUE,1,0))*T9","v":0},{"$f":"IF(LEN(N9)=1,N9,IF(N9=TRUE,1,0))*U9","v":0},{"$f":"IF(LEN(O9)=1,O9,IF(O9=TRUE,1,0))*V9","v":0},{"$f":"IF(LEN(P9)=1,P9,IF(P9=TRUE,1,0))*W9","v":0},{"$f":"IF(LEN(Q9)=1,Q9,IF(Q9=TRUE,1,0))*X9","v":0}]
["QbII.10",null,"Relazione idrologica",null,null,null,"n",null,null,"n",null,false,false,0,false,false,0,null,0.03,0.03,null,0.03,0.03,null,null,0,0,0,0,0,0]
{"$rows_left_out":22}
{"sheet":"Parametri","index":6,"n_rows":28,"n_cols":41,"rows_kept":28,"cut":false,"hidden":true,"merged":[[0,37,0,39],[2,29,2,34],[11,29,11,34],[20,29,20,34],[2,1,2,6],[11,1,11,6],[20,1,20,6],[0,9,0,11],[0,23,0,25],[2,15,2,20],[11,15,11,20],[20,15,20,20]]}
[null,"fino a 250.000","da 250.000 a 500.000","da 500.000 a 1.000.000","da 1.000.000 a 2.500.000","da 2.500.000 a 5.000.000","da 5.000.000 a 10.000.000",null,null,"EDILIZIA",null,null,null,null,null,"fino a 250.000","da 250.000 a 500.000","da 500.000 a 1.000.000","da 1.000.000 a 2.500.000","da 2.500.000 a 5.000.000","da 5.000.000 a 10.000.000",null,null,"IMPIANTI",null,null,null,null,null,"fino a 250.000","da 250.000 a 500.000","da 500.000 a 1.000.000","da 1.000.000 a 2.500.000","da 2.500.000 a 5.000.000","da 5.000.000 a 10.000.000",null,null,"RURALITA'"]
[]
[null,"Relazione geologica - EDILIZIA",null,null,null,null,null,null,null,"Progettazione 1","Progettazione 2","Progettazione 4",null,null,null,"Relazione geologica - IMPIANTI",null,null,null,null,null,null,null,null,"Progettazione 3",null,null,null,null,"Relazione geologica - RURALITA'",null,null,null,null,null,null,null,null,"Progettazione 5"]
[]
["Vp",{"$f":"SUM(J5:L5)","v":0},null,null,null,null,null,null,null,{"$f":"Prestazioni!AG13","v":0},{"$f":"Prestazioni!AH13","v":0},{"$f":"Prestazioni!AJ13","v":0},null,null,"Vp",{"$f":"SUM(X5:Z5)","v":0},null,null,null,null,null,null,null,null,{"$f":"Prestazioni!AI13","v":0},null,null,null,"Vp",{"$f":"SUM(AL5:AN5)","v":0},null,null,null,null,null,null,null,null,{"$f":"Prestazioni!AK13","v":0}]
[null,{"$f":"MIN(B5,250000)","v":0},{"$f":"MIN(B5-B6,250000)","v":0},{"$f":"MIN(B5-B6-C6,500000)","v":0},{"$f":"MIN(B5-B6-C6-D6,1500000)","v":0},{"$f":"MIN(B5-B6-C6-D6-E6,2500000)","v":0},{"$f":"B5-B6-C6-D6-E6-F6","v":0},null,null,{"$f":"H10/B5*J5","v":{"$error":"#DIV/0!"}},{"$f":"H10/B5*K5","v":{"$error":"#DIV/0!"}},{"$f":"H10/B5*L5","v":{"$error":"#DIV/0!"}},null,null,null,{"$f":"MIN(P5,250000)","v":0},{"$f":"MIN(P5-P6,250000)","v":0},{"$f":"MIN(P5-P6-Q6,500000)","v":0},{"$f":"MIN(P5-P6-Q6-R6,1500000)","v":0},{"$f":"MIN(P5-P6-Q6-R6-S6,2500000)","v":0},{"$f":"P5-P6-Q6-R6-S6-T6","v":0},null,null,{"$f":"V10/P5*X5","v":{"$error":"#DIV/0!"}},{"$f":"V10/P5*Y5","v":{"$error":"#DIV/0!"}},{"$f":"V10/P5*Z5","v":{"$error":"#DIV/0!"}},null,null,null,{"$f":"MIN(AD5,250000)","v":0},{"$f":"MIN(AD5-AD6,250000)","v":0},{"$f":"MIN(AD5-AD6-AE6,500000)","v":0},{"$f":"MIN(AD5-AD6-AE6-AF6,1500000)","v":0},{"$f":"MIN(AD5-AD6-AE6-AF6-AG6,2500000)","v":0},{"$f":"AD5-AD6-AE6-AF6-AG6-AH6","v":0},null,null,{"$f":"AJ10/AD5*AL5","v":{"$error":"#DIV/0!"}},{"$f":"AJ10/AD5*AM5","v":{"$error":"#DIV/0!"}},{"$f":"AJ10/AD5*AN5","v":{"$error":"#DIV/0!"}}]
["P",{"$f":"IF(B6=0,0,MIN(10/(POWER(Prestazioni!$AN$2,0.4))+0.03,10/(POWER(25000,0.4))+0.03))","v":0},{"$f":"IF(C6=0,0,B7)","v":0},{"$f":"IF(D6=0,0,C7)","v":0},{"$f":"IF(E6=0,0,D7)","v":0},{"$f":"IF(F6=0,0,E7)","v":0},{"$f":"IF(G6=0,0,E7)","v":0},null,null,null,null,null,null,null,"P",{"$f":"IF(P6=0,0,MIN(10/(POWER(Prestazioni!$AO$2,0.4))+0.03,10/(POWER(25000,0.4))+0.03))","v":0},{"$f":"IF(Q6=0,0,P7)","v":0},{"$f":"IF(R6=0,0,Q7)","v":0},{"$f":"IF(S6=0,0,R7)","v":0},{"$f":"IF(T6=0,0,S7)","v":0},{"$f":"IF(U6=0,0,S7)","v":0},null,null,null,null,null,null,null,"P",{"$f":"IF(AD6=0,0,MIN(10/(POWER(Prestazioni!$AP$2,0.4))+0.03,10/(POWER(25000,0.4))+0.03))","v":0},{"$f":"IF(AE6=0,0,AD7)","v":0},{"$f":"IF(AF6=0,0,AE7)","v":0},{"$f":"IF(AG6=0,0,AF7)","v":0},{"$f":"IF(AH6=0,0,AG7)","v":0},{"$f":"IF(AI6=0,0,AG7)","v":0}]
["Q",6.4000000000000001E-2,1.9E-2,2.1000000000000001E-2,2.9000000000000001E-2,3.7999999999999999E-2,3.7999999999999999E-2,null,null,null,null,null,null,null,"Q",6.4000000000000001E-2,1.9E-2,2.1000000000000001E-2,2.9000000000000001E-2,3.7999999999999999E-2,3.7999999999999999E-2,null,null,null,null,null,null,null,"Q",0.13300000000000001,0.107,9.6000000000000002E-2,7.9000000000000001E-2,5.3999999999999999E-2,5.3999999999999999E-2]
["G",null,null,null,null,null,null,null,null,{"$f":"IF(J5>0,VLOOKUP(J3,Progettazioni!$A$4:$D$9,4,FALSE),0)","v":0},{"$f":"IF(K5>0,VLOOKUP(K3,Progettazioni!$A$4:$D$9,4,FALSE),0)","v":0},{"$f":"IF(L5>0,VLOOKUP(L3,Progettazioni!$A$4:$D$9,4,FALSE),0)","v":0},null,null,"G",null,null,null,null,null,null,null,null,{"$f":"IF(X5>0,VLOOKUP(X3,Progettazioni!$A$4:$D$9,4,FALSE),0)","v":0},{"$f":"IF(Y5>0,VLOOKUP(Y3,Progettazioni!$A$4:$D$9,4,FALSE),0)","v":0},{"$f":"IF(Z5>0,VLOOKUP(Z3,Progettazioni!$A$4:$D$9,4,FALSE),0)","v":0},null,null,"G",null,null,null,null,null,null,null,null,{"$f":"IF(AL5>0,VLOOKUP(AL3,Progettazioni!$A$4:$D$9,4,FALSE),0)","v":0},{"$f":"IF(AM5>0,VLOOKUP(AM3,Progettazioni!$A$4:$D$9,4,FALSE),0)","v":0},{"$f":"IF(AN5>0,VLOOKUP(AN3,Progettazioni!$A$4:$D$9,4,FALSE),0)","v":0}]
[null,{"$f":"B6*B7*B8","v":0},{"$f":"C6*C7*C8","v":0},0,0,0,0,{"$f":"SUM(B10:G10)","v":0},null,{"$f":"J6*J9","v":{"$error":"#DIV/0!"}},{"$f":"K6*K9","v":{"$error":"#DIV/0!"}},{"$error":"#DIV/0!"},{"$f":"SUM(J10:L10)","v":{"$error":"#DIV/0!"}},null,null,{"$f":"P6*P7*P8","v":0},{"$f":"Q6*Q7*Q8","v":0},{"$f":"R6*R7*R8","v":0},0,0,0,{"$f":"SUM(P10:U10)","v":0},null,{"$f":"X6*X9","v":{"$error":"#DIV/0!"}},{"$f":"Y6*Y9","v":{"$error":"#DIV/0!"}},{"$error":"#DIV/0!"},{"$f":"SUM(X10:Z10)","v":{"$error":"#DIV/0!"}},null,null,{"$f":"AD6*AD7*AD8","v":0},{"$f":"AE6*AE7*AE8","v":0},0,0,0,0,{"$f":"SUM(AD10:AI10)","v":0},null,{"$f":"AL6*AL9","v":{"$error":"#DIV/0!"}},{"$f":"AM6*AM9","v":{"$error":"#DIV/0!"}},{"$error":"#DIV/0!"},{"$f":"SUM(AL10:AN10)","v":{"$error":"#DIV/0!"}}]
{"$rows_left_out":19}
{"sheet":"CALCOLO CS","index":7,"n_rows":96,"n_cols":12,"rows_kept":96,"cut":false,"hidden":false,"merged":[[94,8,95,8],[94,9,95,9],[93,0,93,1],[94,2,95,5],[94,6,95,6],[94,7,95,7],[92,0,92,4],[85,0,85,4],[86,0,86,4],[87,0,87,4],[88,0,88,4],[90,0,90,4],[89,0,89,4],[17,2,17,6],[19,6,24,6],[29,2,29,6],[31,6,36,6],[91,0,91,4],[43,1,45,1],[43,2,45,2],[43,3,45,3],[19,1,21,1],[19,2,21,2],[19,3,21,3],[31,1,33,1],[31,2,33,2],[31,3,33,3],[83,0,83,6],[85,6,91,6],[65,2,65,6],[55,1,57,1],[55,2,57,2],[55,3,57,3],[67,1,69,1],[67,2,69,2],[67,3,69,3],[0,0,0,6],[4,1,4,6],[5,2,5,5],[7,6,12,6],[3,0,3,6],[7,1,9,1],[7,2,9,2],[7,3,9,3],[84,0,84,4],[1,1,1,6],[41,2,41,6],[43,6,48,6],[55,6,60,6],[53,2,53,6],[67,6,72,6],[79,0,79,4],[80,0,80,4],[81,0,81,4],[64,1,64,6],[52,1,52,6],[40,1,40,6],[28,1,28,6],[16,1,16,6],[76,0,77,6]]}
["CALCOLO SPESE GENERALI (spese di progettazione e altre spese generali)"]
["RICHIEDENTE"]
[]
["SPESE DI PROGETTAZIONE - COSTI SEMPLIFICATI",null,null,null,null,null,null,"importo max richiedibile","importo max delle spese generali"]
["Progettazione 1"," Edifici rurali di tipo complesso"]
["Vp1",{"$f":"Progettazioni!F4","v":0}]
[null,"Relazione geologica","Studio Impatto Ambientale (VIA)","Piano di monitoraggio ambientale (VIA)","Altre prestazioni","costo semplificato P1","costo semplificato P1 nel rispetto dei limiti previsti dalle D.G.","Totale spesa progettazioni P1-P2-P4-P5 (PT)",{"$f":"+B6+B18+B42+B54","v":0}]
["P",null,null,null,{"$f":"IFERROR(MIN(10/(POWER(Prestazioni!$AN$2,0.4))+0.03,10/(POWER(25000,0.4))+0.03),0)","v":0},null,null,null,{"$f":"+IF(I7<=$L$8,I7*$J$8,IF(I7>$L$8,$L$8*$J$8,0))","v":0},0.1,0,500000]
["Q",null,null,null,{"$f":"Prestazioni!Z31","v":1.27},null,null,null,{"$f":"+IF(AND(I7>$K$9,I7<=$L$9),(I7-$K$9)*$J$9,IF(I7>$L$9,($L$9-$K$9)*$J$9,0))","v":0},0.05,500000,1000000]
["G",null,null,null,{"$f":"VLOOKUP(A5,Progettazioni!$A$4:$D$9,4,FALSE)","v":0.95},null,null,null,{"$f":"+IF(I7>$K$10,(I7-$K$10)*$J$10,0)","v":0},2.5000000000000001E-2,1000000]
{"$rows_left_out":87}
{"sheet":"Elenchi","index":8,"n_rows":8,"n_cols":1,"rows_kept":8,"cut":false,"hidden":true,"merged":[]}
["altre spese"]
[]
["PARCELLE NOTARILI"]
["PARCELLE PER CONSULENZE LEGALI"]
["SPESE PER AZIONI INFORMATIVE E PUBBLICITARIE"]
["SPESE PER CONSULENZA TECNICA E FINANZIARIA"]
["SPESE PER GARANZIE FIDEIUSSORIE"]
["SPESE PER TENUTA CONTO CORRENTE DEDICATO"]

{"sheet":"SA","index":9,"n_rows":7,"n_cols":9,"rows_kept":7,"cut":false,"hidden":true,"merged":[]}
[]
["CALCOLO DELLE SPESE ACCESSORIE"]
[null,"y","x"]
["valore percentuale s.a. a € 0:",0.1,0,null,null,null,null,"m",{"$f":"(B4-B5)/(C4-C5)","v":-5.0000000000000001E-9}]
["valore percentuale s.a. a € 10.000.000:",0.05,10000000,null,null,null,null,"q",{"$f":"(C4*B5-C5*B4)/(C4-C5)","v":0.1}]
[]
["calcola valore s.a. per un investimento complessivo di:",null,5000000,null,{"$f":"I4*C7+I5","v":7.5000000000000011E-2},null,null,"y=mx+q"]