{"text_format":"1","workbook":"xlsx","n_sheets":4,"sheets":["ElencoUCS","CalcoloCS","Tab_Categorie","elenchi"],"not_rendered":{"charts":0,"images":1,"macros":1,"external_links":0,"defined_names":5,"comments":0,"pivot_tables":0},"unopened":[],"bounds":{"document_bytes":16777216,"sheet_cells":100000,"rows_first":2000,"rows_last":500,"rows_between":2000,"halvings":0,"cell_chars":16384,"cell_head_chars":4096},"cells_cut":0,"cells_raw":0,"read":"whole","date_system":"1900"}

{"sheet":"ElencoUCS","index":0,"n_rows":16,"n_cols":59,"rows_kept":16,"cut":false,"hidden":true,"merged":[[0,2,2,2],[0,0,2,1]]}
["SOTTOCATEGORIE",null,"classi potenza","(01TraConT_TG)   <   13,40","(01TraConT_TG) - da   13,40  a   48,40","(01TraConT_TG) - da   48,41  a   68,00","(01TraConT_TG) - da   68,01  a   84,40","(01TraConT_TG)   >   84,40","(02TraConC_TM)   <   41,00","(02TraConC_TM) - da   41,00  a   65,50","(02TraConC_TM) - da   65,51  a   82,50","(02TraConC_TM) - da   82,51  a   199,00","(02TraConC_TM)   >   199,00","(03TraConC_TP)   <   55,00","(03TraConC_TP) - da   55,00  a   86,10","(03TraConC_TP) - da   86,11  a   125,50","(03TraConC_TP) - da   125,51  a   276,00","(03TraConC_TP)   >   276,00","(04TraConC_TV)   <   55,00","(04TraConC_TV) - da   55,00  a   124,30","(04TraConC_TV) - da   124,31  a   203,00","(04TraConC_TV) - da   203,01  a   492,00","(04TraConC_TV)   >   492,00","(05TraSpeT_TG)   <   15,00","(05TraSpeT_TG) - da   15,00  a   48,30","(05TraSpeT_TG) - da   48,31  a   62,75","(05TraSpeT_TG) - da   62,76  a   79,00","(05TraSpeT_TG)   >   79,00","(06TraSpeC_TM)   <   26,00","(06TraSpeC_TM) - da   26,00  a   61,50","(06TraSpeC_TM) - da   61,51  a   72,05","(06TraSpeC_TM) - da   72,06  a   82,00","(06TraSpeC_TM)   >   82,00","(07TraSpeC_TV)   <   33,40","(07TraSpeC_TV) - da   33,40  a   73,50","(07TraSpeC_TV) - da   73,51  a   82,00","(07TraSpeC_TV)   >   82,00","(08TraCinT_TG)   <   55,00","(08TraCinT_TG) - da   55,00  a   65,00","(08TraCinT_TG) - da   65,01  a   79,00","(08TraCinT_TG)   >   79,00","(09TraCinC_TM)   <   63,00","(09TraCinC_TM) - da   63,00  a   79,00","(09TraCinC_TM)   >   79,00","(10TraCinC_TV)   <   255,00","(10TraCinC_TV) - da   255,00  a   345,00","(10TraCinC_TV) - da   345,01  a   407,00","(10TraCinC_TV) - da   407,01  a   514,00","(10TraCinC_TV)   >   514,00","(11MieFis__FI)   <   123,00","(11MieFis__FI) - da   123,00  a   237,50","(11MieFis__FI) - da   237,51  a   311,70","(11MieFis__FI) - da   311,71  a   581,00","(11MieFis__FI)   >   581,00","(12MieAut__AL)   <   179,00","(12MieAut__AL) - da   179,00  a   227,50","(12MieAut__AL) - da   227,51  a   272,50","(12MieAut__AL) - da   272,51  a   483,00","(12MieAut__AL)   >   483,00"]
[null,null,null,13.4,13.4,48.41,68.010000000000005,84.4,41,41,65.510000000000005,82.51,199,55,55,86.11,125.51,276,55,55,124.31,203.01,492,15,15,48.31,62.76,79,26,26,61.51,72.06,82,33.4,33.4,73.510000000000005,82,55,55,65.010000000000005,79,63,63,79,255,255,345.01,407.01,514,123,123,237.51,311.70999999999998,581,179,179,227.51,272.51,483]
[null,null,null,"<",48.4,68,84.4,">","<",65.5,82.5,199,">","<",86.1,125.5,276,">","<",124.3,203,492,">","<",48.3,62.75,79,">","<",61.5,72.05,82,">","<",73.5,82,">","<",65,79,">","<",79,">","<",345,407,514,">","<",237.5,311.7,581,">","<",227.5,272.5,483,">"]
[null,null,null,1,2,3,4,5,6,7,8,9,10,11,12,13,14,15,16,17,18,19,20,21,22,23,24,25,26,27,28,29,30,31,32,33,34,35,36,37,38,39,40,41,42,43,44,45,46,47,48,49,50,51,52,53,54,55,56]
["01TraConT_TG","Trattori convenzionali con protezione arco/telaio",1,642.29,642.29,611.91999999999996,602.28,602.28]
["02TraConC_TM","Trattori convenzionali cabinati con trasmissione meccanica",2,null,null,null,null,null,672.71,672.71,699.12,735.22,735.22]
["03TraConC_TP","Trattori convenzionali cabinati con trasmissione powershift",3,null,null,null,null,null,null,null,null,null,null,719.47,719.47,737.98,752.83,752.83]
["04TraConC_TV","Trattori convenzionali cabinati con trasmissione CVT",4,null,null,null,null,null,null,null,null,null,null,null,null,null,null,null,904.81,904.81,828.48,786.6,786.6]
["05TraSpeT_TG","Trattori specializzati con protezione arco/telaio",5,null,null,null,null,null,null,null,null,null,null,null,null,null,null,null,null,null,null,null,null,690.66,690.66,654.16999999999996,639.44000000000005,639.44000000000005]
["06TraSpeC_TM","Trattori specializzati cabinati con trasmissione meccanica",6,null,null,null,null,null,null,null,null,null,null,null,null,null,null,null,null,null,null,null,null,null,null,null,null,null,732.28,732.28,684.17,646.66,646.66]
["07TraSpeC_TV","Trattori specializzati cabinati con trasmissione powershift o CVT",7,null,null,null,null,null,null,null,null,null,null,null,null,null,null,null,null,null,null,null,null,null,null,null,null,null,null,null,null,null,null,1010.99,1010.99,972.69,972.69]
["08TraCinT_TG","Trattori cingolati con protezione arco/telaio",8,null,null,null,null,null,null,null,null,null,null,null,null,null,null,null,null,null,null,null,null,null,null,null,null,null,null,null,null,null,null,null,null,null,null,689.21,689.21,707.1,707.1]
["09TraCinC_TM","Trattori cingolati cabinati con trasmissione meccanica",9,null,null,null,null,null,null,null,null,null,null,null,null,null,null,null,null,null,null,null,null,null,null,null,null,null,null,null,null,null,null,null,null,null,null,null,null,null,null,839.99,839.99,839.99]
["10TraCinC_TV","Trattori cingolati cabinati con trasmissione powershift o CVT",10,null,null,null,null,null,null,null,null,null,null,null,null,null,null,null,null,null,null,null,null,null,null,null,null,null,null,null,null,null,null,null,null,null,null,null,null,null,null,null,null,null,988.02,988.02,1156.5,899.82,899.82]
["11MieFis__FI","Mietitrebbie fisse",11,null,null,null,null,null,null,null,null,null,null,null,null,null,null,null,null,null,null,null,null,null,null,null,null,null,null,null,null,null,null,null,null,null,null,null,null,null,null,null,null,null,null,null,null,null,null,972.05,972.05,926.69,893.42,893.42]
["12MieAut__AL","Mietitrebbie autolivellanti",12,null,null,null,null,null,null,null,null,null,null,null,null,null,null,null,null,null,null,null,null,null,null,null,null,null,null,null,null,null,null,null,null,null,null,null,null,null,null,null,null,null,null,null,null,null,null,null,null,null,null,null,1147.1400000000001,1147.1400000000001,1066.69,990.59,990.59]

{"sheet":"CalcoloCS","index":1,"n_rows":13,"n_cols":10,"rows_kept":13,"cut":false,"hidden":false,"merged":[[1,8,1,9],[1,2,1,3],[1,0,2,0],[1,4,1,7],[0,0,0,9]]}
["CALCOLO DEL COSTO SEMPLIFICATO PER TRATTORI E MIETITREBBIE"]
["n.",null,"Categoria",null," Potenza",null,null,null,"Costo standard"]
[null,"marca e modello","codice","descrizione","classe",null,"potenza motore (Kw)","controllo","€/Kw","€"]
[1,null,null,{"$f":"+IF(C4=\"\",\"\",VLOOKUP(C4,ElencoUCS!$A$5:$B$16,2,FALSE))","v":""},null,{"$f":"MID(E4,18,1)","v":""},null,{"$f":"+IF(AND(B4=\"\",C4=\"\",E4=\"\"),\"\",IF(OR(B4=\"\",C4=\"\",E4=\"\"),\"inserire marca e/o codice e/o classe\",IF(G4=\"\",\"inserire potenza\",IF(INDEX(ElencoUCS!$D$5:$BG$16,+VLOOKUP(C4,ElencoUCS!$A$5:$C$16,3,FALSE),+HLOOKUP(E4,ElencoUCS!$D$1:$BG$4,4,FALSE))=0,\"classe di potenza non associabile\",IF(INDEX(ElencoUCS!$D$5:$BG$16,+VLOOKUP(C4,ElencoUCS!$A$5:$C$16,3,FALSE),+HLOOKUP(E4,ElencoUCS!$D$1:$BG$4,4,FALSE))<>0,IF(AND(F4=\"d\",HLOOKUP(E4,ElencoUCS!$D$1:$BG$4,2,FALSE)<=G4,HLOOKUP(E4,ElencoUCS!$D$1:$BG$4,3,FALSE)>=G4),\"\",IF(AND(F4=\">\",HLOOKUP(E4,ElencoUCS!$D$1:$BG$4,2,FALSE)<G4),\"\",IF(AND(F4=\"<\",HLOOKUP(E4,ElencoUCS!$D$1:$BG$4,2,FALSE)>G4),\"\",\"I dati non sono coerenti\"))))))))","v":""},{"$f":"+IF(E4=\"\",\"\",IF(C4=\"\",0,IF(OR(H4=\"I dati non sono coerenti\",H4=\"inserire marca e/o codice e/o classe\",H4=\"inserire potenza\",H4=\"classe di potenza non associabile\"),\"costo non verificabile\",IF(INDEX(ElencoUCS!$D$5:$BG$16,+VLOOKUP(C4,ElencoUCS!$A$5:$C$16,3,FALSE),+HLOOKUP(E4,ElencoUCS!$D$1:$BG$4,4,FALSE))>0,INDEX(ElencoUCS!$D$5:$BG$16,+VLOOKUP(C4,ElencoUCS!$A$5:$C$16,3,FALSE),+HLOOKUP(E4,ElencoUCS!$D$1:$BG$4,4,FALSE))))))","v":""},{"$f":"IFERROR(G4*I4,\"\")","v":""}]
[2,null,null,{"$f":"+IF(C5=\"\",\"\",VLOOKUP(C5,ElencoUCS!$A$5:$B$16,2,FALSE))","v":""},null,{"$f":"MID(E5,18,1)","v":""},null,{"$f":"+IF(AND(B5=\"\",C5=\"\",E5=\"\"),\"\",IF(OR(B5=\"\",C5=\"\",E5=\"\"),\"inserire marca e/o codice e/o classe\",IF(G5=\"\",\"inserire potenza\",IF(INDEX(ElencoUCS!$D$5:$BG$16,+VLOOKUP(C5,ElencoUCS!$A$5:$C$16,3,FALSE),+HLOOKUP(E5,ElencoUCS!$D$1:$BG$4,4,FALSE))=0,\"classe di potenza non associabile\",IF(INDEX(ElencoUCS!$D$5:$BG$16,+VLOOKUP(C5,ElencoUCS!$A$5:$C$16,3,FALSE),+HLOOKUP(E5,ElencoUCS!$D$1:$BG$4,4,FALSE))<>0,IF(AND(F5=\"d\",HLOOKUP(E5,ElencoUCS!$D$1:$BG$4,2,FALSE)<=G5,HLOOKUP(E5,ElencoUCS!$D$1:$BG$4,3,FALSE)>=G5),\"\",IF(AND(F5=\">\",HLOOKUP(E5,ElencoUCS!$D$1:$BG$4,2,FALSE)<G5),\"\",IF(AND(F5=\"<\",HLOOKUP(E5,ElencoUCS!$D$1:$BG$4,2,FALSE)>G5),\"\",\"I dati non sono coerenti\"))))))))","v":""},{"$f":"+IF(E5=\"\",\"\",IF(C5=\"\",0,IF(OR(H5=\"I dati non sono coerenti\",H5=\"inserire marca e/o codice e/o classe\",H5=\"inserire potenza\",H5=\"classe di potenza non associabile\"),\"costo non verificabile\",IF(INDEX(ElencoUCS!$D$5:$BG$16,+VLOOKUP(C5,ElencoUCS!$A$5:$C$16,3,FALSE),+HLOOKUP(E5,ElencoUCS!$D$1:$BG$4,4,FALSE))>0,INDEX(ElencoUCS!$D$5:$BG$16,+VLOOKUP(C5,ElencoUCS!$A$5:$C$16,3,FALSE),+HLOOKUP(E5,ElencoUCS!$D$1:$BG$4,4,FALSE))))))","v":""},{"$f":"IFERROR(G5*I5,\"\")","v":""}]
[3,null,null,{"$f":"+IF(C6=\"\",\"\",VLOOKUP(C6,ElencoUCS!$A$5:$B$16,2,FALSE))","v":""},null,"",null,{"$f":"+IF(AND(B6=\"\",C6=\"\",E6=\"\"),\"\",IF(OR(B6=\"\",C6=\"\",E6=\"\"),\"inserire marca e/o codice e/o classe\",IF(G6=\"\",\"inserire potenza\",IF(INDEX(ElencoUCS!$D$5:$BG$16,+VLOOKUP(C6,ElencoUCS!$A$5:$C$16,3,FALSE),+HLOOKUP(E6,ElencoUCS!$D$1:$BG$4,4,FALSE))=0,\"classe di potenza non associabile\",IF(INDEX(ElencoUCS!$D$5:$BG$16,+VLOOKUP(C6,ElencoUCS!$A$5:$C$16,3,FALSE),+HLOOKUP(E6,ElencoUCS!$D$1:$BG$4,4,FALSE))<>0,IF(AND(F6=\"d\",HLOOKUP(E6,ElencoUCS!$D$1:$BG$4,2,FALSE)<=G6,HLOOKUP(E6,ElencoUCS!$D$1:$BG$4,3,FALSE)>=G6),\"\",IF(AND(F6=\">\",HLOOKUP(E6,ElencoUCS!$D$1:$BG$4,2,FALSE)<G6),\"\",IF(AND(F6=\"<\",HLOOKUP(E6,ElencoUCS!$D$1:$BG$4,2,FALSE)>G6),\"\",\"I dati non sono coerenti\"))))))))","v":""},{"$f":"+IF(E6=\"\",\"\",IF(C6=\"\",0,IF(OR(H6=\"I dati non sono coerenti\",H6=\"inserire marca e/o codice e/o classe\",H6=\"inserire potenza\",H6=\"classe di potenza non associabile\"),\"costo non verificabile\",IF(INDEX(ElencoUCS!$D$5:$BG$16,+VLOOKUP(C6,ElencoUCS!$A$5:$C$16,3,FALSE),+HLOOKUP(E6,ElencoUCS!$D$1:$BG$4,4,FALSE))>0,INDEX(ElencoUCS!$D$5:$BG$16,+VLOOKUP(C6,ElencoUCS!$A$5:$C$16,3,FALSE),+HLOOKUP(E6,ElencoUCS!$D$1:$BG$4,4,FALSE))))))","v":""},""]
[4,null,null,{"$f":"+IF(C7=\"\",\"\",VLOOKUP(C7,ElencoUCS!$A$5:$B$16,2,FALSE))","v":""},null,"",null,{"$f":"+IF(AND(B7=\"\",C7=\"\",E7=\"\"),\"\",IF(OR(B7=\"\",C7=\"\",E7=\"\"),\"inserire marca e/o codice e/o classe\",IF(G7=\"\",\"inserire potenza\",IF(INDEX(ElencoUCS!$D$5:$BG$16,+VLOOKUP(C7,ElencoUCS!$A$5:$C$16,3,FALSE),+HLOOKUP(E7,ElencoUCS!$D$1:$BG$4,4,FALSE))=0,\"classe di potenza non associabile\",IF(INDEX(ElencoUCS!$D$5:$BG$16,+VLOOKUP(C7,ElencoUCS!$A$5:$C$16,3,FALSE),+HLOOKUP(E7,ElencoUCS!$D$1:$BG$4,4,FALSE))<>0,IF(AND(F7=\"d\",HLOOKUP(E7,ElencoUCS!$D$1:$BG$4,2,FALSE)<=G7,HLOOKUP(E7,ElencoUCS!$D$1:$BG$4,3,FALSE)>=G7),\"\",IF(AND(F7=\">\",HLOOKUP(E7,ElencoUCS!$D$1:$BG$4,2,FALSE)<G7),\"\",IF(AND(F7=\"<\",HLOOKUP(E7,ElencoUCS!$D$1:$BG$4,2,FALSE)>G7),\"\",\"I dati non sono coerenti\"))))))))","v":""},{"$f":"+IF(E7=\"\",\"\",IF(C7=\"\",0,IF(OR(H7=\"I dati non sono coerenti\",H7=\"inserire marca e/o codice e/o classe\",H7=\"inserire potenza\",H7=\"classe di potenza non associabile\"),\"costo non verificabile\",IF(INDEX(ElencoUCS!$D$5:$BG$16,+VLOOKUP(C7,ElencoUCS!$A$5:$C$16,3,FALSE),+HLOOKUP(E7,ElencoUCS!$D$1:$BG$4,4,FALSE))>0,INDEX(ElencoUCS!$D$5:$BG$16,+VLOOKUP(C7,ElencoUCS!$A$5:$C$16,3,FALSE),+HLOOKUP(E7,ElencoUCS!$D$1:$BG$4,4,FALSE))))))","v":""},""]
[5,null,null,{"$f":"+IF(C8=\"\",\"\",VLOOKUP(C8,ElencoUCS!$A$5:$B$16,2,FALSE))","v":""},null,"",null,{"$f":"+IF(AND(B8=\"\",C8=\"\",E8=\"\"),\"\",IF(OR(B8=\"\",C8=\"\",E8=\"\"),\"inserire marca e/o codice e/o classe\",IF(G8=\"\",\"inserire potenza\",IF(INDEX(ElencoUCS!$D$5:$BG$16,+VLOOKUP(C8,ElencoUCS!$A$5:$C$16,3,FALSE),+HLOOKUP(E8,ElencoUCS!$D$1:$BG$4,4,FALSE))=0,\"classe di potenza non associabile\",IF(INDEX(ElencoUCS!$D$5:$BG$16,+VLOOKUP(C8,ElencoUCS!$A$5:$C$16,3,FALSE),+HLOOKUP(E8,ElencoUCS!$D$1:$BG$4,4,FALSE))<>0,IF(AND(F8=\"d\",HLOOKUP(E8,ElencoUCS!$D$1:$BG$4,2,FALSE)<=G8,HLOOKUP(E8,ElencoUCS!$D$1:$BG$4,3,FALSE)>=G8),\"\",IF(AND(F8=\">\",HLOOKUP(E8,ElencoUCS!$D$1:$BG$4,2,FALSE)<G8),\"\",IF(AND(F8=\"<\",HLOOKUP(E8,ElencoUCS!$D$1:$BG$4,2,FALSE)>G8),\"\",\"I dati non sono coerenti\"))))))))","v":""},{"$f":"+IF(E8=\"\",\"\",IF(C8=\"\",0,IF(OR(H8=\"I dati non sono coerenti\",H8=\"inserire marca e/o codice e/o classe\",H8=\"inserire potenza\",H8=\"classe di potenza non associabile\"),\"costo non verificabile\",IF(INDEX(ElencoUCS!$D$5:$BG$16,+VLOOKUP(C8,ElencoUCS!$A$5:$C$16,3,FALSE),+HLOOKUP(E8,ElencoUCS!$D$1:$BG$4,4,FALSE))>0,INDEX(ElencoUCS!$D$5:$BG$16,+VLOOKUP(C8,ElencoUCS!$A$5:$C$16,3,FALSE),+HLOOKUP(E8,ElencoUCS!$D$1:$BG$4,4,FALSE))))))","v":""},""]
[6,null,null,{"$f":"+IF(C9=\"\",\"\",VLOOKUP(C9,ElencoUCS!$A$5:$B$16,2,FALSE))","v":""},null,"",null,{"$f":"+IF(AND(B9=\"\",C9=\"\",E9=\"\"),\"\",IF(OR(B9=\"\",C9=\"\",E9=\"\"),\"inserire marca e/o codice e/o classe\",IF(G9=\"\",\"inserire potenza\",IF(INDEX(ElencoUCS!$D$5:$BG$16,+VLOOKUP(C9,ElencoUCS!$A$5:$C$16,3,FALSE),+HLOOKUP(E9,ElencoUCS!$D$1:$BG$4,4,FALSE))=0,\"classe di potenza non associabile\",IF(INDEX(ElencoUCS!$D$5:$BG$16,+VLOOKUP(C9,ElencoUCS!$A$5:$C$16,3,FALSE),+HLOOKUP(E9,ElencoUCS!$D$1:$BG$4,4,FALSE))<>0,IF(AND(F9=\"d\",HLOOKUP(E9,ElencoUCS!$D$1:$BG$4,2,FALSE)<=G9,HLOOKUP(E9,ElencoUCS!$D$1:$BG$4,3,FALSE)>=G9),\"\",IF(AND(F9=\">\",HLOOKUP(E9,ElencoUCS!$D$1:$BG$4,2,FALSE)<G9),\"\",IF(AND(F9=\"<\",HLOOKUP(E9,ElencoUCS!$D$1:$BG$4,2,FALSE)>G9),\"\",\"I dati non sono coerenti\"))))))))","v":""},{"$f":"+IF(E9=\"\",\"\",IF(C9=\"\",0,IF(OR(H9=\"I dati non sono coerenti\",H9=\"inserire marca e/o codice e/o classe\",H9=\"inserire potenza\",H9=\"classe di potenza non associabile\"),\"costo non verificabile\",IF(INDEX(ElencoUCS!$D$5:$BG$16,+VLOOKUP(C9,ElencoUCS!$A$5:$C$16,3,FALSE),+HLOOKUP(E9,ElencoUCS!$D$1:$BG$4,4,FALSE))>0,INDEX(ElencoUCS!$D$5:$BG$16,+VLOOKUP(C9,ElencoUCS!$A$5:$C$16,3,FALSE),+HLOOKUP(E9,ElencoUCS!$D$1:$BG$4,4,FALSE))))))","v":""},""]
[7,null,null,{"$f":"+IF(C10=\"\",\"\",VLOOKUP(C10,ElencoUCS!$A$5:$B$16,2,FALSE))","v":""},null,"",null,{"$f":"+IF(AND(B10=\"\",C10=\"\",E10=\"\"),\"\",IF(OR(B10=\"\",C10=\"\",E10=\"\"),\"inserire marca e/o codice e/o classe\",IF(G10=\"\",\"inserire potenza\",IF(INDEX(ElencoUCS!$D$5:$BG$16,+VLOOKUP(C10,ElencoUCS!$A$5:$C$16,3,FALSE),+HLOOKUP(E10,ElencoUCS!$D$1:$BG$4,4,FALSE))=0,\"classe di potenza non associabile\",IF(INDEX(ElencoUCS!$D$5:$BG$16,+VLOOKUP(C10,ElencoUCS!$A$5:$C$16,3,FALSE),+HLOOKUP(E10,ElencoUCS!$D$1:$BG$4,4,FALSE))<>0,IF(AND(F10=\"d\",HLOOKUP(E10,ElencoUCS!$D$1:$BG$4,2,FALSE)<=G10,HLOOKUP(E10,ElencoUCS!$D$1:$BG$4,3,FALSE)>=G10),\"\",IF(AND(F10=\">\",HLOOKUP(E10,ElencoUCS!$D$1:$BG$4,2,FALSE)<G10),\"\",IF(AND(F10=\"<\",HLOOKUP(E10,ElencoUCS!$D$1:$BG$4,2,FALSE)>G10),\"\",\"I dati non sono coerenti\"))))))))","v":""},{"$f":"+IF(E10=\"\",\"\",IF(C10=\"\",0,IF(OR(H10=\"I dati non sono coerenti\",H10=\"inserire marca e/o codice e/o classe\",H10=\"inserire potenza\",H10=\"classe di potenza non associabile\"),\"costo non verificabile\",IF(INDEX(ElencoUCS!$D$5:$BG$16,+VLOOKUP(C10,ElencoUCS!$A$5:$C$16,3,FALSE),+HLOOKUP(E10,ElencoUCS!$D$1:$BG$4,4,FALSE))>0,INDEX(ElencoUCS!$D$5:$BG$16,+VLOOKUP(C10,ElencoUCS!$A$5:$C$16,3,FALSE),+HLOOKUP(E10,ElencoUCS!$D$1:$BG$4,4,FALSE))))))","v":""},""]
[8,null,null,{"$f":"+IF(C11=\"\",\"\",VLOOKUP(C11,ElencoUCS!$A$5:$B$16,2,FALSE))","v":""},null,"",null,{"$f":"+IF(AND(B11=\"\",C11=\"\",E11=\"\"),\"\",IF(OR(B11=\"\",C11=\"\",E11=\"\"),\"inserire marca e/o codice e/o classe\",IF(G11=\"\",\"inserire potenza\",IF(INDEX(ElencoUCS!$D$5:$BG$16,+VLOOKUP(C11,ElencoUCS!$A$5:$C$16,3,FALSE),+HLOOKUP(E11,ElencoUCS!$D$1:$BG$4,4,FALSE))=0,\"classe di potenza non associabile\",IF(INDEX(ElencoUCS!$D$5:$BG$16,+VLOOKUP(C11,ElencoUCS!$A$5:$C$16,3,FALSE),+HLOOKUP(E11,ElencoUCS!$D$1:$BG$4,4,FALSE))<>0,IF(AND(F11=\"d\",HLOOKUP(E11,ElencoUCS!$D$1:$BG$4,2,FALSE)<=G11,HLOOKUP(E11,ElencoUCS!$D$1:$BG$4,3,FALSE)>=G11),\"\",IF(AND(F11=\">\",HLOOKUP(E11,ElencoUCS!$D$1:$BG$4,2,FALSE)<G11),\"\",IF(AND(F11=\"<\",HLOOKUP(E11,ElencoUCS!$D$1:$BG$4,2,FALSE)>G11),\"\",\"I dati non sono coerenti\"))))))))","v":""},{"$f":"+IF(E11=\"\",\"\",IF(C11=\"\",0,IF(OR(H11=\"I dati non sono coerenti\",H11=\"inserire marca e/o codice e/o classe\",H11=\"inserire potenza\",H11=\"classe di potenza non associabile\"),\"costo non verificabile\",IF(INDEX(ElencoUCS!$D$5:$BG$16,+VLOOKUP(C11,ElencoUCS!$A$5:$C$16,3,FALSE),+HLOOKUP(E11,ElencoUCS!$D$1:$BG$4,4,FALSE))>0,INDEX(ElencoUCS!$D$5:$BG$16,+VLOOKUP(C11,ElencoUCS!$A$5:$C$16,3,FALSE),+HLOOKUP(E11,ElencoUCS!$D$1:$BG$4,4,FALSE))))))","v":""},""]
[9,null,null,{"$f":"+IF(C12=\"\",\"\",VLOOKUP(C12,ElencoUCS!$A$5:$B$16,2,FALSE))","v":""},null,"",null,{"$f":"+IF(AND(B12=\"\",C12=\"\",E12=\"\"),\"\",IF(OR(B12=\"\",C12=\"\",E12=\"\"),\"inserire marca e/o codice e/o classe\",IF(G12=\"\",\"inserire potenza\",IF(INDEX(ElencoUCS!$D$5:$BG$16,+VLOOKUP(C12,ElencoUCS!$A$5:$C$16,3,FALSE),+HLOOKUP(E12,ElencoUCS!$D$1:$BG$4,4,FALSE))=0,\"classe di potenza non associabile\",IF(INDEX(ElencoUCS!$D$5:$BG$16,+VLOOKUP(C12,ElencoUCS!$A$5:$C$16,3,FALSE),+HLOOKUP(E12,ElencoUCS!$D$1:$BG$4,4,FALSE))<>0,IF(AND(F12=\"d\",HLOOKUP(E12,ElencoUCS!$D$1:$BG$4,2,FALSE)<=G12,HLOOKUP(E12,ElencoUCS!$D$1:$BG$4,3,FALSE)>=G12),\"\",IF(AND(F12=\">\",HLOOKUP(E12,ElencoUCS!$D$1:$BG$4,2,FALSE)<G12),\"\",IF(AND(F12=\"<\",HLOOKUP(E12,ElencoUCS!$D$1:$BG$4,2,FALSE)>G12),\"\",\"I dati non sono coerenti\"))))))))","v":""},{"$f":"+IF(E12=\"\",\"\",IF(C12=\"\",0,IF(OR(H12=\"I dati non sono coerenti\",H12=\"inserire marca e/o codice e/o classe\",H12=\"inserire potenza\",H12=\"classe di potenza non associabile\"),\"costo non verificabile\",IF(INDEX(ElencoUCS!$D$5:$BG$16,+VLOOKUP(C12,ElencoUCS!$A$5:$C$16,3,FALSE),+HLOOKUP(E12,ElencoUCS!$D$1:$BG$4,4,FALSE))>0,INDEX(ElencoUCS!$D$5:$BG$16,+VLOOKUP(C12,ElencoUCS!$A$5:$C$16,3,FALSE),+HLOOKUP(E12,ElencoUCS!$D$1:$BG$4,4,FALSE))))))","v":""},""]
[10,null,null,{"$f":"+IF(C13=\"\",\"\",VLOOKUP(C13,ElencoUCS!$A$5:$B$16,2,FALSE))","v":""},null,"",null,{"$f":"+IF(AND(B13=\"\",C13=\"\",E13=\"\"),\"\",IF(OR(B13=\"\",C13=\"\",E13=\"\"),\"inserire marca e/o codice e/o classe\",IF(G13=\"\",\"inserire potenza\",IF(INDEX(ElencoUCS!$D$5:$BG$16,+VLOOKUP(C13,ElencoUCS!$A$5:$C$16,3,FALSE),+HLOOKUP(E13,ElencoUCS!$D$1:$BG$4,4,FALSE))=0,\"classe di potenza non associabile\",IF(INDEX(ElencoUCS!$D$5:$BG$16,+VLOOKUP(C13,ElencoUCS!$A$5:$C$16,3,FALSE),+HLOOKUP(E13,ElencoUCS!$D$1:$BG$4,4,FALSE))<>0,IF(AND(F13=\"d\",HLOOKUP(E13,ElencoUCS!$D$1:$BG$4,2,FALSE)<=G13,HLOOKUP(E13,ElencoUCS!$D$1:$BG$4,3,FALSE)>=G13),\"\",IF(AND(F13=\">\",HLOOKUP(E13,ElencoUCS!$D$1:$BG$4,2,FALSE)<G13),\"\",IF(AND(F13=\"<\",HLOOKUP(E13,ElencoUCS!$D$1:$BG$4,2,FALSE)>G13),\"\",\"I dati non sono coerenti\"))))))))","v":""},{"$f":"+IF(E13=\"\",\"\",IF(C13=\"\",0,IF(OR(H13=\"I dati non sono coerenti\",H13=\"inserire marca e/o codice e/o classe\",H13=\"inserire potenza\",H13=\"classe di potenza non associabile\"),\"costo non verificabile\",IF(INDEX(ElencoUCS!$D$5:$BG$16,+VLOOKUP(C13,ElencoUCS!$A$5:$C$16,3,FALSE),+HLOOKUP(E13,ElencoUCS!$D$1:$BG$4,4,FALSE))>0,INDEX(ElencoUCS!$D$5:$BG$16,+VLOOKUP(C13,ElencoUCS!$A$5:$C$16,3,FALSE),+HLOOKUP(E13,ElencoUCS!$D$1:$BG$4,4,FALSE))))))","v":""},""]

{"sheet":"Tab_Categorie","index":2,"n_rows":58,"n_cols":4,"rows_kept":58,"cut":false,"hidden":false,"merged":[[0,0,0,3]]}
["tabella categorie UCS"]
["Codice","categoria","classe di potenza \n(Kw)","€/Kw"]
["01TraConT_TG","Trattori convenzionali con protezione arco/telaio","(01TraConT_TG)   <   13,40",642.29]
["01TraConT_TG","Trattori convenzionali con protezione arco/telaio","(01TraConT_TG) - da   13,40  a   48,40",642.29]
["01TraConT_TG","Trattori convenzionali con protezione arco/telaio","(01TraConT_TG) - da   48,41  a   68,00",611.91999999999996]
["01TraConT_TG","Trattori convenzionali con protezione arco/telaio","(01TraConT_TG) - da   68,01  a   84,40",602.28]
["01TraConT_TG","Trattori convenzionali con protezione arco/telaio","(01TraConT_TG)   >   84,40",602.28]
["02TraConC_TM","Trattori convenzionali cabinati con trasmissione meccanica","(02TraConC_TM)   <   41,00",672.71]
["02TraConC_TM","Trattori convenzionali cabinati con trasmissione meccanica","(02TraConC_TM) - da   41,00  a   65,50",672.71]
["02TraConC_TM","Trattori convenzionali cabinati con trasmissione meccanica","(02TraConC_TM) - da   65,51  a   82,50",699.12]
["02TraConC_TM","Trattori convenzionali cabinati con trasmissione meccanica","(02TraConC_TM) - da   82,51  a   199,00",735.22]
["02TraConC_TM","Trattori convenzionali cabinati con trasmissione meccanica","(02TraConC_TM)   >   199,00",735.22]
["03TraConC_TP","Trattori convenzionali cabinati con trasmissione powershift","(03TraConC_TP)   <   55,00",719.47]
["03TraConC_TP","Trattori convenzionali cabinati con trasmissione powershift","(03TraConC_TP) - da   55,00  a   86,10",719.47]
["03TraConC_TP","Trattori convenzionali cabinati con trasmissione powershift","(03TraConC_TP) - da   86,11  a   125,50",737.98]
["03TraConC_TP","Trattori convenzionali cabinati con trasmissione powershift","(03TraConC_TP) - da   125,51  a   276,00",752.83]
["03TraConC_TP","Trattori convenzionali cabinati con trasmissione powershift","(03TraConC_TP)   >   276,00",752.83]
["04TraConC_TV","Trattori convenzionali cabinati con trasmissione CVT","(04TraConC_TV)   <   55,00",904.81]
["04TraConC_TV","Trattori convenzionali cabinati con trasmissione CVT","(04TraConC_TV) - da   55,00  a   124,30",904.81]
["04TraConC_TV","Trattori convenzionali cabinati con trasmissione CVT","(04TraConC_TV) - da   124,31  a   203,00",828.48]
{"$rows_left_out":39}
{"sheet":"elenchi","index":3,"n_rows":57,"n_cols":6,"rows_kept":57,"cut":false,"hidden":true,"merged":[]}
["codice","categoria","da","a","codice 1","costo"]
["01TraConT_TG","Trattori convenzionali con protezione arco/telaio",13.4,"<",{"$f":"+IF(OR(D2=\">\",D2=\"<\"),CONCATENATE(\"(\",A2,\")   \",D2,\"   \",TEXT(C2,\"#.###,00\")),CONCATENATE(\"(\",A2,\") - \", \"da   \",TEXT(C2,\"#.###,00\"),\"  a   \",TEXT(D2,\"#.###,00\")))","v":"(01TraConT_TG)   <   13,40"},642.29]
["01TraConT_TG","Trattori convenzionali con protezione arco/telaio",13.4,48.4,{"$f":"+IF(OR(D3=\">\",D3=\"<\"),CONCATENATE(\"(\",A3,\")   \",D3,\"   \",TEXT(C3,\"#.###,00\")),CONCATENATE(\"(\",A3,\") - \", \"da   \",TEXT(C3,\"#.###,00\"),\"  a   \",TEXT(D3,\"#.###,00\")))","v":"(01TraConT_TG) - da   13,40  a   48,40"},642.29]
["01TraConT_TG","Trattori convenzionali con protezione arco/telaio",48.41,68,"(01TraConT_TG) - da   48,41  a   68,00",611.91999999999996]
["01TraConT_TG","Trattori convenzionali con protezione arco/telaio",68.010000000000005,84.4,"(01TraConT_TG) - da   68,01  a   84,40",602.28]
["01TraConT_TG","Trattori convenzionali con protezione arco/telaio",84.4,">","(01TraConT_TG)   >   84,40",602.28]
["02TraConC_TM","Trattori convenzionali cabinati con trasmissione meccanica",41,"<","(02TraConC_TM)   <   41,00",672.71]
["02TraConC_TM","Trattori convenzionali cabinati con trasmissione meccanica",41,65.5,"(02TraConC_TM) - da   41,00  a   65,50",672.71]
["02TraConC_TM","Trattori convenzionali cabinati con trasmissione meccanica",65.510000000000005,82.5,"(02TraConC_TM) - da   65,51  a   82,50",699.12]
["02TraConC_TM","Trattori convenzionali cabinati con trasmissione meccanica",82.51,199,"(02TraConC_TM) - da   82,51  a   199,00",735.22]
["02TraConC_TM","Trattori convenzionali cabinati con trasmissione meccanica",199,">","(02TraConC_TM)   >   199,00",735.22]
["03TraConC_TP","Trattori convenzionali cabinati con trasmissione powershift",55,"<","(03TraConC_TP)   <   55,00",719.47]
["03TraConC_TP","Trattori convenzionali cabinati con trasmissione powershift",55,86.1,"(03TraConC_TP) - da   55,00  a   86,10",719.47]
["03TraConC_TP","Trattori convenzionali cabinati con trasmissione powershift",86.11,125.5,"(03TraConC_TP) - da   86,11  a   125,50",737.98]
["03TraConC_TP","Trattori convenzionali cabinati con trasmissione powershift",125.51,276,"(03TraConC_TP) - da   125,51  a   276,00",752.83]
["03TraConC_TP","Trattori convenzionali cabinati con trasmissione powershift",276,">","(03TraConC_TP)   >   276,00",752.83]
["04TraConC_TV","Trattori convenzionali cabinati con trasmissione CVT",55,"<","(04TraConC_TV)   <   55,00",904.81]
["04TraConC_TV","Trattori convenzionali cabinati con trasmissione CVT",55,124.3,"(04TraConC_TV) - da   55,00  a   124,30",904.81]
["04TraConC_TV","Trattori convenzionali cabinati con trasmissione CVT",124.31,203,"(04TraConC_TV) - da   124,31  a   203,00",828.48]
["04TraConC_TV","Trattori convenzionali cabinati con trasmissione CVT",203.01,492,"(04TraConC_TV) - da   203,01  a   492,00",786.6]
{"$rows_left_out":37}