{"text_format":"1","workbook":"xlsx","n_sheets":4,"sheets":["BANDO N. 3090 A-T 2020","Macro","Menù","Repertorio"],"not_rendered":{"charts":0,"images":0,"macros":1,"external_links":0,"defined_names":2,"comments":0,"pivot_tables":0},"unopened":[],"bounds":{"document_bytes":16777216,"sheet_cells":100000,"rows_first":2000,"rows_last":500,"rows_between":2000,"halvings":0,"cell_chars":16384,"cell_head_chars":4096},"cells_cut":0,"cells_raw":0,"read":"whole","date_system":"1900"}

{"sheet":"BANDO N. 3090 A-T 2020","index":0,"n_rows":299,"n_cols":42,"rows_kept":299,"cut":false,"hidden":false,"merged":[[0,0,0,4],[0,5,0,11],[0,12,0,16],[0,18,0,23],[0,31,0,40]]}
["ANAGRAFICA ORGANISMO DI CONSULENZA",null,null,null,null,"ANAGRAFICA AZIENDA",null,null,null,null,null,null,"SEDI OPERATIVE ORGANISMO DI CONSULENZA",null,null,null,null,null,"ATTIVITA' DI SUPPORTO",null,null,null,null,null,null,null,null,null,null,null,null,"CONSULENTE INCARICATO"]
["LOTTO","Denominazione Organismo di Consulenza","C.F.","PARTITA\n IVA","TIPOLOGIA ORGANISMO \nDI CONSULENZA \n(riconosciuto)","DENOMINAZIONE AZIENDA","RAGIONE SOCIALE","CUAA","MANIFESTAZIONE D'INTERSSE","TIPOLOGIA DI AZIENDA","In caso di Azienda appartenente alla Filiera del Turismo Rurale e dell’Artigianato Artistico \nSPECIFICARE \"ALTRO\"","MACRO-AREA","SEDE OPERATIVA DELL'ORGANISMO DI CONSULENZA - AV","SEDE OPERATIVA DELL'ORGANISMO DI CONSULENZA - BN","SEDE OPERATIVA DELL'ORGANISMO DI CONSULENZA - CE","SEDE OPERATIVA DELL'ORGANISMO DI CONSULENZA - NA","SEDE OPERATIVA DELL'ORGANISMO DI CONSULENZA - SA","MODULO","DETERMINAZIONI ANALITICHE, TECNICHE ED ECONOMICHE","Specificare ALTRO","NUMERO VISITE AZIENDALI","SUPPORTI E STRUMENTI INFORMATICI","STRUMENTI PER MONITORARE LA QUALITA'","NEWSLETTER, BLOG, \nFORUM, COMMUNITY, \nFAQ, CHAT","COSTO unitario consulenze singole","ANNO di riferimento della consulenza","CONSULENZA COLLETTIVA","COSTO \nunitario consulenza collettiva","FOCUS \nAREA","FABBISOGNO \nPREVALENTE ","TARGETING","COGNOME","NOME","C.F. Consulenti","RICONOSCIUTO","AMBITO DI \nCONSULENZA","ANNI DI \nESPERIENZA","TITOLO DI STUDIO","SECONDA \nLAUREA","NUMERO CORSI DI AGGIORNAMENTO","NUMERO DI PUBBLICAZIONI","RISPONDENZA AGLI OBIETTIVI TRASVERSALI"]
[null,null,null,null,null,null,null,null,null,null,null,null,null,null,null,null,null,null,null,null,null,null,null,null,{"$f":"IF($R3<>0,VLOOKUP($R3,Repertorio!$A$2:$M$85,11),\"\")","v":""},null,null,null,{"$f":"IF($R3<>0,VLOOKUP($R3,Repertorio!$A$2:$M$85,8),\"\")","v":""},{"$f":"IF($R3<>0,VLOOKUP($R3,Repertorio!$A$2:$M$85,10),\"\")","v":""},null,null,null,null,null,{"$f":"IF($R3<>0,VLOOKUP($R3,Repertorio!$A$2:$M$85,7),\"\")","v":""}]
[null,{"$f":"+IF($A4<>\"\",B$3,\"\")","v":""},"","",null,null,null,null,null,null,null,null,null,null,null,null,null,null,null,null,null,null,null,null,{"$f":"IF($R4<>0,VLOOKUP($R4,Repertorio!$A$2:$M$85,11),\"\")","v":""},null,null,null,{"$f":"IF($R4<>0,VLOOKUP($R4,Repertorio!$A$2:$M$85,8),\"\")","v":""},{"$f":"IF($R4<>0,VLOOKUP($R4,Repertorio!$A$2:$M$85,10),\"\")","v":""},null,null,null,null,null,{"$f":"IF($R4<>0,VLOOKUP($R4,Repertorio!$A$2:$M$85,7),\"\")","v":""}]
[null,"","","",null,null,null,null,null,null,null,null,null,null,null,null,null,null,null,null,null,null,null,null,{"$f":"IF($R5<>0,VLOOKUP($R5,Repertorio!$A$2:$M$85,11),\"\")","v":""},null,null,null,{"$f":"IF($R5<>0,VLOOKUP($R5,Repertorio!$A$2:$M$85,8),\"\")","v":""},{"$f":"IF($R5<>0,VLOOKUP($R5,Repertorio!$A$2:$M$85,10),\"\")","v":""},null,null,null,null,null,{"$f":"IF($R5<>0,VLOOKUP($R5,Repertorio!$A$2:$M$85,7),\"\")","v":""}]
[null,"","","",null,null,null,null,null,null,null,null,null,null,null,null,null,null,null,null,null,null,null,null,{"$f":"IF($R6<>0,VLOOKUP($R6,Repertorio!$A$2:$M$85,11),\"\")","v":""},null,null,null,{"$f":"IF($R6<>0,VLOOKUP($R6,Repertorio!$A$2:$M$85,8),\"\")","v":""},{"$f":"IF($R6<>0,VLOOKUP($R6,Repertorio!$A$2:$M$85,10),\"\")","v":""},null,null,null,null,null,{"$f":"IF($R6<>0,VLOOKUP($R6,Repertorio!$A$2:$M$85,7),\"\")","v":""}]
[null,"","","",null,null,null,null,null,null,null,null,null,null,null,null,null,null,null,null,null,null,null,null,{"$f":"IF($R7<>0,VLOOKUP($R7,Repertorio!$A$2:$M$85,11),\"\")","v":""},null,null,null,{"$f":"IF($R7<>0,VLOOKUP($R7,Repertorio!$A$2:$M$85,8),\"\")","v":""},{"$f":"IF($R7<>0,VLOOKUP($R7,Repertorio!$A$2:$M$85,10),\"\")","v":""},null,null,null,null,null,{"$f":"IF($R7<>0,VLOOKUP($R7,Repertorio!$A$2:$M$85,7),\"\")","v":""}]
[null,"","","",null,null,null,null,null,null,null,null,null,null,null,null,null,null,null,null,null,null,null,null,{"$f":"IF($R8<>0,VLOOKUP($R8,Repertorio!$A$2:$M$85,11),\"\")","v":""},null,null,null,{"$f":"IF($R8<>0,VLOOKUP($R8,Repertorio!$A$2:$M$85,8),\"\")","v":""},{"$f":"IF($R8<>0,VLOOKUP($R8,Repertorio!$A$2:$M$85,10),\"\")","v":""},null,null,null,null,null,{"$f":"IF($R8<>0,VLOOKUP($R8,Repertorio!$A$2:$M$85,7),\"\")","v":""}]
[null,"","","",null,null,null,null,null,null,null,null,null,null,null,null,null,null,null,null,null,null,null,null,{"$f":"IF($R9<>0,VLOOKUP($R9,Repertorio!$A$2:$M$85,11),\"\")","v":""},null,null,null,{"$f":"IF($R9<>0,VLOOKUP($R9,Repertorio!$A$2:$M$85,8),\"\")","v":""},{"$f":"IF($R9<>0,VLOOKUP($R9,Repertorio!$A$2:$M$85,10),\"\")","v":""},null,null,null,null,null,{"$f":"IF($R9<>0,VLOOKUP($R9,Repertorio!$A$2:$M$85,7),\"\")","v":""}]
[null,"","","",null,null,null,null,null,null,null,null,null,null,null,null,null,null,null,null,null,null,null,null,{"$f":"IF($R10<>0,VLOOKUP($R10,Repertorio!$A$2:$M$85,11),\"\")","v":""},null,null,null,{"$f":"IF($R10<>0,VLOOKUP($R10,Repertorio!$A$2:$M$85,8),\"\")","v":""},{"$f":"IF($R10<>0,VLOOKUP($R10,Repertorio!$A$2:$M$85,10),\"\")","v":""},null,null,null,null,null,{"$f":"IF($R10<>0,VLOOKUP($R10,Repertorio!$A$2:$M$85,7),\"\")","v":""}]
[null,"","","",null,null,null,null,null,null,null,null,null,null,null,null,null,null,null,null,null,null,null,null,{"$f":"IF($R11<>0,VLOOKUP($R11,Repertorio!$A$2:$M$85,11),\"\")","v":""},null,null,null,{"$f":"IF($R11<>0,VLOOKUP($R11,Repertorio!$A$2:$M$85,8),\"\")","v":""},{"$f":"IF($R11<>0,VLOOKUP($R11,Repertorio!$A$2:$M$85,10),\"\")","v":""},null,null,null,null,null,{"$f":"IF($R11<>0,VLOOKUP($R11,Repertorio!$A$2:$M$85,7),\"\")","v":""}]
[null,"","","",null,null,null,null,null,null,null,null,null,null,null,null,null,null,null,null,null,null,null,null,{"$f":"IF($R12<>0,VLOOKUP($R12,Repertorio!$A$2:$M$85,11),\"\")","v":""},null,null,null,{"$f":"IF($R12<>0,VLOOKUP($R12,Repertorio!$A$2:$M$85,8),\"\")","v":""},{"$f":"IF($R12<>0,VLOOKUP($R12,Repertorio!$A$2:$M$85,10),\"\")","v":""},null,null,null,null,null,{"$f":"IF($R12<>0,VLOOKUP($R12,Repertorio!$A$2:$M$85,7),\"\")","v":""}]
[null,"","","",null,null,null,null,null,null,{"$f":"+IF(J13<>\"C9. Altro\",\"\",\"Valorizzare\")","v":""},null,null,null,null,null,null,null,null,null,null,null,null,null,{"$f":"IF($R13<>0,VLOOKUP($R13,Repertorio!$A$2:$M$85,11),\"\")","v":""},null,null,null,{"$f":"IF($R13<>0,VLOOKUP($R13,Repertorio!$A$2:$M$85,8),\"\")","v":""},{"$f":"IF($R13<>0,VLOOKUP($R13,Repertorio!$A$2:$M$85,10),\"\")","v":""},null,null,null,null,null,{"$f":"IF($R13<>0,VLOOKUP($R13,Repertorio!$A$2:$M$85,7),\"\")","v":""}]
[null,"","","",null,null,null,null,null,null,"",null,null,null,null,null,null,null,null,null,null,null,null,null,{"$f":"IF($R14<>0,VLOOKUP($R14,Repertorio!$A$2:$M$85,11),\"\")","v":""},null,null,null,{"$f":"IF($R14<>0,VLOOKUP($R14,Repertorio!$A$2:$M$85,8),\"\")","v":""},{"$f":"IF($R14<>0,VLOOKUP($R14,Repertorio!$A$2:$M$85,10),\"\")","v":""},null,null,null,null,null,{"$f":"IF($R14<>0,VLOOKUP($R14,Repertorio!$A$2:$M$85,7),\"\")","v":""}]
[null,"","","",null,null,null,null,null,null,"",null,null,null,null,null,null,null,null,null,null,null,null,null,{"$f":"IF($R15<>0,VLOOKUP($R15,Repertorio!$A$2:$M$85,11),\"\")","v":""},null,null,null,{"$f":"IF($R15<>0,VLOOKUP($R15,Repertorio!$A$2:$M$85,8),\"\")","v":""},{"$f":"IF($R15<>0,VLOOKUP($R15,Repertorio!$A$2:$M$85,10),\"\")","v":""},null,null,null,null,null,{"$f":"IF($R15<>0,VLOOKUP($R15,Repertorio!$A$2:$M$85,7),\"\")","v":""}]
[null,"","","",null,null,null,null,null,null,"",null,null,null,null,null,null,null,null,null,null,null,null,null,{"$f":"IF($R16<>0,VLOOKUP($R16,Repertorio!$A$2:$M$85,11),\"\")","v":""},null,null,null,{"$f":"IF($R16<>0,VLOOKUP($R16,Repertorio!$A$2:$M$85,8),\"\")","v":""},{"$f":"IF($R16<>0,VLOOKUP($R16,Repertorio!$A$2:$M$85,10),\"\")","v":""},null,null,null,null,null,{"$f":"IF($R16<>0,VLOOKUP($R16,Repertorio!$A$2:$M$85,7),\"\")","v":""}]
[null,"","","",null,null,null,null,null,null,"",null,null,null,null,null,null,null,null,null,null,null,null,null,{"$f":"IF($R17<>0,VLOOKUP($R17,Repertorio!$A$2:$M$85,11),\"\")","v":""},null,null,null,{"$f":"IF($R17<>0,VLOOKUP($R17,Repertorio!$A$2:$M$85,8),\"\")","v":""},{"$f":"IF($R17<>0,VLOOKUP($R17,Repertorio!$A$2:$M$85,10),\"\")","v":""},null,null,null,null,null,{"$f":"IF($R17<>0,VLOOKUP($R17,Repertorio!$A$2:$M$85,7),\"\")","v":""}]
[null,"","","",null,null,null,null,null,null,"",null,null,null,null,null,null,null,null,null,null,null,null,null,{"$f":"IF($R18<>0,VLOOKUP($R18,Repertorio!$A$2:$M$85,11),\"\")","v":""},null,null,null,{"$f":"IF($R18<>0,VLOOKUP($R18,Repertorio!$A$2:$M$85,8),\"\")","v":""},{"$f":"IF($R18<>0,VLOOKUP($R18,Repertorio!$A$2:$M$85,10),\"\")","v":""},null,null,null,null,null,{"$f":"IF($R18<>0,VLOOKUP($R18,Repertorio!$A$2:$M$85,7),\"\")","v":""}]
[null,"","","",null,null,null,null,null,null,"",null,null,null,null,null,null,null,null,null,null,null,null,null,{"$f":"IF($R19<>0,VLOOKUP($R19,Repertorio!$A$2:$M$85,11),\"\")","v":""},null,null,null,{"$f":"IF($R19<>0,VLOOKUP($R19,Repertorio!$A$2:$M$85,8),\"\")","v":""},{"$f":"IF($R19<>0,VLOOKUP($R19,Repertorio!$A$2:$M$85,10),\"\")","v":""},null,null,null,null,null,{"$f":"IF($R19<>0,VLOOKUP($R19,Repertorio!$A$2:$M$85,7),\"\")","v":""}]
[null,"","","",null,null,null,null,null,null,"",null,null,null,null,null,null,null,null,null,null,null,null,null,{"$f":"IF($R20<>0,VLOOKUP($R20,Repertorio!$A$2:$M$85,11),\"\")","v":""},null,null,null,{"$f":"IF($R20<>0,VLOOKUP($R20,Repertorio!$A$2:$M$85,8),\"\")","v":""},{"$f":"IF($R20<>0,VLOOKUP($R20,Repertorio!$A$2:$M$85,10),\"\")","v":""},null,null,null,null,null,{"$f":"IF($R20<>0,VLOOKUP($R20,Repertorio!$A$2:$M$85,7),\"\")","v":""}]
{"$rows_left_out":280}
{"sheet":"Macro","index":1,"n_rows":0,"n_cols":0,"rows_kept":0,"cut":false,"hidden":true,"merged":[]}

{"sheet":"Menù","index":2,"n_rows":84,"n_cols":16,"rows_kept":84,"cut":false,"hidden":true,"merged":[]}
["LOTTO","SCELTA /SI/NO)","TIPOLOGIA AZIENDA","CodModulo","Macroarea","Sede Avellino","Sede Benevento","Sede Caserta","Sede Salerno","Sede Napoli","TITOLO STUDIO","TARGETING","ANNO CONSULENZA","ANNI","Ragione Sociale","Rispondenza"]
["Lotto 1 – Area GAL Irno Cavese - Terra è Vita","SI","A1. Cerealicolo",1,"A","Avellino","Benevento","Caserta","Salerno","Napoli","Master 1° livello o diploma di specializzazione","Beneficiari di altre misure del PSR",2017,0,"SPA",5]
["Lotto 2 – Area GAL Vallo di Diano","NO","A2. Orticolo",{"$f":"(D2+1)","v":2},"B",null,null,null,null,null,"Dottorato di ricerca o master 2° livello","Giovani agricoltori",2018,{"$f":"1+N2","v":1},"SRL",3]
["Lotto 3 – Area GAL Irpinia",null,"A3. Floricolo",3,"C",null,null,null,null,null,null,"Imprese che partecipano ad iniziative promosse dai G.O. della misura 16",2019,{"$f":"1+N3","v":2},"D.I.",1]
["Lotto 4 – Area GAL Casacastra",null,"A4. Frutticolo",4,"D",null,null,null,null,null,null,"No",2020,3,"SCPA"]
["Lotto 5 - Area GAL Alto Casertano",null,"A5. Agrumicolo",5,null,null,null,null,null,null,null,null,2021,4,"SS"]
["Lotto 6 - Area GAL Taburno - GAL Area Fortore",null,"A6. Vitivinicolo",6,null,null,null,null,null,null,null,null,2022,5,"SnC"]
["Lotto 7 - Area GAL Alto Tammaro - GAL Titerno",null,"A7. Olivicolo",7,null,null,null,null,null,null,null,null,2023,6,"Sas"]
["Lotto 8 - Area GAL Cilento Regeneratio",null,"A8. Zootecnico",8,null,null,null,null,null,null,null,null,2024,7,"Altro"]
["Lotto 9 - Area GAL I Sentieri del Buonvivere",null,"B1. Vitivinicolo",9,null,null,null,null,null,null,null,null,2025,8]
["Lotto 10 - Area GAL Terra Protetta",null,"B2. Ortofrutticolo IV e V gamma",10,null,null,null,null,null,null,null,null,null,9]
["Lotto 11 - Area GAL Vesuvio Verde",null,"B3. Conserviero tradizionale",11,null,null,null,null,null,null,null,null,null,10]
["Lotto 12 - Area GAL Partenio",null,"B4. Lattiero caseario",12,null,null,null,null,null,null,null,null,null,11]
["Lotto 13 - Area GAL Serinese Solofrana",null,"B5. Lavorazione delle carni fresche e stagionate",13,null,null,null,null,null,null,null,null,null,12]
["Lotto 14 - Area GAL Colline Salernitane",null,"B6. Oleario",14,null,null,null,null,null,null,null,null,null,13]
["Lotto 15 - Area GAL Irpinia Sannio - Cilsi",null,"B7. Lavorazione piante industriali",15,null,null,null,null,null,null,null,null,null,14]
[null,null,"B8. Miele",16,null,null,null,null,null,null,null,null,null,15]
[null,null,"C1. Ristorazione agrituristica e tradizionale",17,null,null,null,null,null,null,null,null,null,16]
[null,null,"C2. Accoglienza alberghiera",18,null,null,null,null,null,null,null,null,null,17]
[null,null,"C3. Accoglienza extra-alberghiera",19,null,null,null,null,null,null,null,null,null,18]
{"$rows_left_out":65}
{"sheet":"Repertorio","index":3,"n_rows":85,"n_cols":14,"rows_kept":85,"cut":false,"hidden":true,"merged":[]}
[1,{"$f":"+A1+1","v":2},{"$f":"+B1+1","v":3},4,5,6,7,8,9,10,11,12,13,14]
["CodModulo","Macro-moduli","modulo","tipologia","contenuti","ambito scheda di misura","ambito decreto","FA principale","consulenza collettiva","fabbisogno prevalente","prezzo massimo ammissibile/azienda","prezzo massimo attività collettiva","output da rendicontare","DETERMINAZIONI"]
[1,"agricoltura ecocompatibile","introduzione della coltivazione di colture innovative ","speciale","introduzione di colture innovative, con specifico riferimento alle esperienze derivate dalla misura 124 del PSR 2007-2013 e della sottomisura 16.1 azione b  del PSR 2014-2020","3, 12","H","2A","collettivo","F03",1000,20000,"Relazione dettagliata su risultati economici ottenuti con documentazione fotografica attività svolte","Rel. risult. econ. e doc. fotogr. attiv. svolte"]
[{"$f":"(A3+1)","v":2},"agricoltura ecocompatibile","biomarketing","speciale","consulenza di marketing per gruppi di aziende certificate con metodo biologico","3, 12","C","2A","collettivo","F04",1000,20000,"Piano di marketing e copia dei supporti promozionali realizzati","Piano marketing e copia supp. promoz. realizzati"]
[3,"agricoltura ecocompatibile","protezione fitosanitaria delle colture con metodo biologico","speciale","consulenza intensiva sulla protezione delle piante coltivate con metodo biologico per una specifica coltura","1, 2, 5, 12","E","3A",null,"F07",500,null,"Relazione su risultati ottenuti con documentazione fotografica attività svolte","Rel. risult. ottenuti e doc. fotogr. attiv. Svolte"]
[4,"agricoltura ecocompatibile","conversione aziendale all'agricoltura biologica","base","valutazione dell'opportunità della conversione rispetto alla situazione aziendale, familiare, del lavoro, analisi economica, informazione sulla normativa, analisi del mercato dei prodotti aziendali e relativa assistenza amministrativa","1, 2, 3, 5, 12","H","2A",null,"F07",1000,null,"Certificazione dell'organismo di controllo sullo status raggiunto di \"impresa in conversione\"","Cert. org. controllo status impr. in conversione"]
[5,"agricoltura ecocompatibile","miglioramento delle performance di aziende in agricoltura biologica","speciale","progettazione ed esecuzione del modello operativo di agricoltura biologica in una impresa già in conversione, piano di marketing, ottimizzazione del lavoro e dei fattori di produzione aziendali","2, 3, 5, 12","C","2A",null,"F07",1000,null,"Relazione dettagliata su risultati economici raggiunti e piano di marketing","Rel. risultati econ. raggiunti e piano marketing"]
[6,"agricoltura ecocompatibile","coltivazione con metodo biologico","base","gestione di una coltura specifica con metodo biologico","1, 2, 5, 12","J","2A",null,"F07",500,null,"Relazione dettagliata su risultati economici ottenuti con documentazione fotografica attività svolte","Rel. risult. econ. e doc. fotogr. attiv. svolte"]
[7,"agricoltura ecocompatibile","trasformazione dei prodotti biologici","speciale","analisi swot, consulenza sulle tecnologie da applicare e sull'organizzazione aziendale (lavoro, famiglia dell'imprenditore) per l'introduzione di attività di trasfomazione dei prodotti aziendali al fine di mantenere la certificazione anche sul trasformato, assistenza nell'etichettatura.","3, 12","C","2A",null,"F07",1500,null,"Relazione dettagliata su risultati economici ottenuti con documentazione fotografica attività svolte; Certificazione dell'organismo di controllo sullo status raggiunto di \"impresa in conversione\" per il prodotto trasformato","Rel e Cert status  impr. in conv. per prod trasf"]
[8,"agricoltura ecocompatibile","foraggicoltura e gestione dei pascoli nelle aziende zootecniche biologiche","speciale","miglioramento delle attività di foraggicoltura e di gestione dei pascoli attraverso pratiche agronomiche  compatibili con il metodo di agricoltura biologica","1, 2, 12","J","2A","collettivo","F07",500,10000,"Relazione su risultati ottenuti con documentazione fotografica attività svolte","Rel. risult. ottenuti e doc. fotogr. attiv. Svolte"]
[9,"ambiente ed energia","biodiversità","speciale","analisi ambientale, individuazione delle risorse di biodiversità agricola, naturale e zootecnica da conservare e sviluppare, individuazione di produzioni rispondenti ai requisiti di cui al DM 350/99 e/o a rischio di estinzione","2, 3, 11","K","P4",null,"F13",1500,null,"Elaborati proposti per l'inserimento nell'elenco PAT o nel registro biodiversità","Elab. per ins. elenco PAT o registro biodiversità"]
[10,"ambiente ed energia","paesaggio","speciale","formulazione di un piano d'azione aziendale per l'inserimento di pratiche ecocompatibili e di sviluppo della biodiversità, di miglioramento del paesaggio e sviluppo di attività di integrazione del reddito legate alla salvaguardia del paesaggio e all'estensivizzazione delle colture nonché della conservazione di elementi caratterizzanti del paesaggio (laghetti, stagni, siepi, etc)","2, 3, 8, 11","K","P4","collettivo","F14",1500,30000,"Elaborati relativi al piano d'azione aziendale, documentazione fotografica dettagliata prima e dopo gli interventi","Elab. piano aziend. doc. fot. dett. prim/dopo int."]
[11,"ambiente ed energia","armonizzazione delle attività agrosilvopastorali in aree protette","base","analisi delle attività di impresa ed introduzione di accorgimenti organizzativi e gestionali atti a superare i vincoli imposti dalle norme di salvaguardia delle aree protette (parchi nazionali, regionali, aree Natura 2000)","2, 3, 8","C","P4","collettivo","F14",500,10000,"Relazione su risultati ottenuti con documentazione fotografica attività svolte","Rel. risult. ottenuti e doc. fotogr. attiv. Svolte"]
[12,"ambiente ed energia","efficienza energetica","speciale","ottimizzare l'uso dell'energia attraverso l'analisi dei consumi per singolo processo, aumentare l'efficienza energetica attraverso adeguamenti strutturali volti al risparmio energetico, etc","2, 3","C","6A",null,"F19",500,null,"Relazione su risultati ottenuti con documentazione fotografica attività svolte","Rel. risult. ottenuti e doc. fotogr. attiv. Svolte"]
[13,"ambiente ed energia","gestione della frazione organica dei rifiuti ","speciale","assistenza alla gestione ed alla corretta utilizzazione del compost derivato dal compostaggio di RSU attraverso una rete di imprese (minimo 20 aziende)","8, 9, 10, 11","K","6A","collettivo","F23",1000,30000,"Relazione dettagliata su soluzioni tecniche adottate, risultati economici ottenuti con documentazione fotografica attività svolte","Rel sol tec adot ris econom doc fotogr att. Svolte"]
[14,"attività di allevamento","miglioramento delle performances di aziende zootecniche - gestione della riproduzione","base","introduzione di azioni di miglioramento della base genetica aziendale, valutazione delle prestazioni produttive riferite all'ambiente in cui opera l'impresa, e del sistema di stabulazione adottato","1, 3, 12","C","2A",null,"F03",1000,null,"Relazione dettagliata su risultati economici ottenuti con documentazione fotografica attività svolte","Rel. risult. econ. e doc. fotogr. attiv. svolte"]
[15,"attività di allevamento","miglioramento delle performances di aziende zootecniche - gestione della alimentazione","base","analisi degli alimenti di origine aziendale, introduzione di tecniche colturali innovative, formulazione della razione alimentare","3, 12","C","2A",null,"F03",1000,null,"Formulazione della razione alimentare aziendale, corredata di analisi dei foraggi e degli alimenti di origine aziendale, per classi omogenee di animali allevati, coerente con la consistenza di stalla","Raz alim analisi forag e alim orig az consist stal"]
[16,"attività di allevamento","azioni di salvaguardia dell'integrità del patrimonio zootecnico e di contrasto alle zoonosi ","base","attività di consulenza legate a temi individuati dall'amministrazione di rilevanza strategica ai fini della salute degli animali in allevamento e della sicurezza alimentare degli alimenti di origine zootecnica","8, 12","M","3A","collettivo","F03",500,"non previsto","Relazione sulle attività svolte corredata di documenti relativi ad eventuali farmaci e/o vaccini somministrati","Rel att svolte con doc rel a farmaci e/o vacc somm"]
[17,"attività di allevamento","adeguamento delle strutture di allevamento","base","analisi finalizzata all'individuazione delle migliori soluzioni organizzative, strutturali, tecnologiche per adeguare e/o progettare ex novo un allevamento di bestiame moderno e competitivo","1, 3, 4, 9, 12","C","2A",null,"F03",1500,null,"Relazione dettagliata su risultati economici ottenuti con documentazione fotografica attività svolte","Rel. risult. econ. e doc. fotogr. attiv. svolte"]
[18,"attività di allevamento","miglioramento delle performances di aziende zootecniche","speciale","analisi della struttura produttiva aziendale in termini di reddito, organizzazione del lavoro, produttività, disponibilità di alimenti di origine aziendale; individuazione degli obiettivi imprenditoriali , analisi swot, identificazione e valutazione delle possibili strategie di sviluppo","3, 4, 9, 12, 13","C*","3A",null,"F03",1000,null,"Relazione dettagliata su risultati economici ottenuti con documentazione fotografica attività svolte","Rel. risult. econ. e doc. fotogr. attiv. svolte"]
{"$rows_left_out":65}